Note: This is a public test instance of Red Hat Bugzilla. The data contained within is a snapshot of the live data so any changes you make will not be reflected in the production Bugzilla. Email is disabled so feel free to test any aspect of the site that you want. File any problems you find or give feedback at

Bug 1900763

Summary: python-typing-inspect fails to build with Python 3.10: AssertionError: {'x': ForwardRef('int'), 'y': ForwardRef('int')} != {'x': <class 'int'>, 'y': <class 'int'>}
Product: [Fedora] Fedora Reporter: Tomáš Hrnčiar <thrnciar>
Component: python-typing-inspectAssignee: Anna Khaitovich <akhaitovich>
Status: CLOSED RAWHIDE QA Contact: Fedora Extras Quality Assurance <extras-qa>
Severity: unspecified Docs Contact:
Priority: unspecified    
Version: rawhideCC: mhroncok, thrnciar
Target Milestone: ---   
Target Release: ---   
Hardware: Unspecified   
OS: Unspecified   
Fixed In Version: Doc Type: If docs needed, set a value
Doc Text:
Story Points: ---
Clone Of: Environment:
Last Closed: 2021-06-14 10:37:55 UTC Type: Bug
Regression: --- Mount Type: ---
Documentation: --- CRM:
Verified Versions: Category: ---
oVirt Team: --- RHEL 7.3 requirements from Atomic Host:
Cloudforms Team: --- Target Upstream Version:
Bug Depends On:    
Bug Blocks: 1890881    

Description Tomáš Hrnčiar 2020-11-23 16:46:53 UTC
python-typing-inspect fails to build with Python 3.10.0a2.

FAIL: test_typed_dict (test_typing_inspect.GetUtilityTestCase)
Traceback (most recent call last):
  File "/builddir/build/BUILD/typing_inspect-0.6.0/", line 402, in test_typed_dict
    self.assertEqual(typed_dict_keys(TD), {'x': int, 'y': int})
AssertionError: {'x': ForwardRef('int'), 'y': ForwardRef('int')} != {'x': <class 'int'>, 'y': <class 'int'>}
- {'x': ForwardRef('int'), 'y': ForwardRef('int')}
+ {'x': <class 'int'>, 'y': <class 'int'>}

Ran 22 tests in 0.010s

FAILED (failures=1, skipped=3)
Test failed: <unittest.runner.TextTestResult run=22 errors=0 failures=1>
error: Test failed: <unittest.runner.TextTestResult run=22 errors=0 failures=1>
error: Bad exit status from /var/tmp/rpm-tmp.uTasEw (%check)
    Bad exit status from /var/tmp/rpm-tmp.uTasEw (%check)

For the build logs, see:

For all our attempts to build python-typing-inspect with Python 3.10, see:

Testing and mass rebuild of packages is happening in copr. You can follow these instructions to test locally in mock if your package builds with Python 3.10:

Let us know here if you have any questions.

Python 3.10 will be included in Fedora 35. To make that update smoother, we're building Fedora packages with early pre-releases of Python 3.10.
A build failure prevents us from testing all dependent packages (transitive [Build]Requires), so if this package is required a lot, it's important for us to get it fixed soon.
We'd appreciate help from the people who know this package best, but if you don't want to work on this now, let us know so we can try to work around it on our side.

Comment 1 Fedora Admin user for bugzilla script actions 2021-01-26 00:06:26 UTC
This package has changed maintainer in Fedora. Reassigning to the new maintainer of this component.

Comment 2 Ben Cotton 2021-02-09 15:27:49 UTC
This bug appears to have been reported against 'rawhide' during the Fedora 34 development cycle.
Changing version to 34.

Comment 3 Miro Hrončok 2021-06-04 20:14:08 UTC
This is a mass-posted update. Sorry if it is not 100% accurate to this bugzilla.

The Python 3.10 rebuild is in progress in a Koji side tag. If you manage to fix the problem, please commit the fix in the rawhide branch, but don't build the package in regular rawhide.

You can either build the package in the side tag, with:

    $ fedpkg build --target=f35-python

Or you can the build and we will eventually build it for you.

Note that the rebuild is still in progress, so not all (build) dependencies of this package might be available right away.


See also

If you have general questions about the rebuild, please use this mailing list thread:

Comment 4 Miro Hrončok 2021-06-07 22:58:49 UTC
The f35-python side tag has been merged to Rawhide. From now on, build as you would normally build.

Comment 5 Miro Hrončok 2021-06-14 10:37:55 UTC
This package was successfully rebuilt with Python 3.10.

If you need this bugzilla open for tracking purposes, sorry for the automatic closing: feel free to reopen it.