Note: This is a public test instance of Red Hat Bugzilla. The data contained within is a snapshot of the live data so any changes you make will not be reflected in the production Bugzilla. Email is disabled so feel free to test any aspect of the site that you want. File any problems you find or give feedback at

Bug 1915660

Summary: python-botocore fails to build with Python 3.10: AssertionError: False is not true
Product: [Fedora] Fedora Reporter: Tomáš Hrnčiar <thrnciar>
Component: python-botocoreAssignee: David Duncan <davdunc>
Status: CLOSED RAWHIDE QA Contact: Fedora Extras Quality Assurance <extras-qa>
Severity: unspecified Docs Contact:
Priority: unspecified    
Version: rawhideCC: bperkins, davdunc, gholms, gwync, lkundrak, me, mhroncok, thrnciar
Target Milestone: ---   
Target Release: ---   
Hardware: Unspecified   
OS: Unspecified   
Fixed In Version: Doc Type: If docs needed, set a value
Doc Text:
Story Points: ---
Clone Of: Environment:
Last Closed: 2021-01-13 14:29:06 UTC Type: Bug
Regression: --- Mount Type: ---
Documentation: --- CRM:
Verified Versions: Category: ---
oVirt Team: --- RHEL 7.3 requirements from Atomic Host:
Cloudforms Team: --- Target Upstream Version:
Bug Depends On:    
Bug Blocks: 1890881    

Description Tomáš Hrnčiar 2021-01-13 07:54:44 UTC
python-botocore fails to build with Python 3.10.0a4.

FAIL: test_stress_test_token_bucket (tests.functional.retries.test_bucket.TestTokenBucketThreading)
Traceback (most recent call last):
  File "/builddir/build/BUILD/botocore-1.19.52/tests/functional/retries/", line 109, in test_stress_test_token_bucket
    self.assertTrue(not any(x < (0.2 * mean) for x in distribution))
AssertionError: False is not true

For the build logs, see:

For all our attempts to build python-botocore with Python 3.10, see:

Testing and mass rebuild of packages is happening in copr. You can follow these instructions to test locally in mock if your package builds with Python 3.10:

Let us know here if you have any questions.

Python 3.10 will be included in Fedora 35. To make that update smoother, we're building Fedora packages with early pre-releases of Python 3.10.
A build failure prevents us from testing all dependent packages (transitive [Build]Requires), so if this package is required a lot, it's important for us to get it fixed soon.
We'd appreciate help from the people who know this package best, but if you don't want to work on this now, let us know so we can try to work around it on our side.

Comment 1 Gwyn Ciesla 2021-01-13 14:29:06 UTC
False positive caused by transient test failure. Upstream is aware.