Note: This is a public test instance of Red Hat Bugzilla. The data contained within is a snapshot of the live data so any changes you make will not be reflected in the production Bugzilla. Email is disabled so feel free to test any aspect of the site that you want. File any problems you find or give feedback at
Bug 1958901 - python-zope-schema fails to build with Python 3.10: test___provides___w_field_w_provides (zope.schema.tests.test_accessors.FieldReadAccessorTests) test fails [failing tests disabled]
Summary: python-zope-schema fails to build with Python 3.10: test___provides___w_field...
Status: NEW
Alias: None
Product: Fedora
Classification: Fedora
Component: python-zope-schema
Version: rawhide
Hardware: Unspecified
OS: Unspecified
Target Milestone: ---
Assignee: Aurelien Bompard
QA Contact: Fedora Extras Quality Assurance
Depends On:
Blocks: PYTHON3.10
TreeView+ depends on / blocked
Reported: 2021-05-10 11:59 UTC by Miro Hrončok
Modified: 2021-06-14 10:22 UTC (History)
5 users (show)

Fixed In Version:
Doc Type: If docs needed, set a value
Doc Text:
Clone Of:
Last Closed:
Type: Bug

Attachments (Terms of Use)

Description Miro Hrončok 2021-05-10 11:59:16 UTC
python-zope-schema fails to build with Python 3.10.0b1:

FAIL: test___provides___w_field_w_provides (zope.schema.tests.test_accessors.FieldReadAccessorTests)
Traceback (most recent call last):
  File "/builddir/build/BUILD/zope.schema-4.4.2/src/zope/schema/tests/", line 67, in test___provides___w_field_w_provides
AssertionError: Lists differ: [<InterfaceClass zope.interface.interfaces.IMethod>, <Interface[198 chars]ute>] != [<InterfaceClass zope.schema._bootstrapinterfaces.IFromUnicode>[199 chars]ent>]

First differing element 0:
<InterfaceClass zope.interface.interfaces.IMethod>
<InterfaceClass zope.schema._bootstrapinterfaces.IFromUnicode>

- [<InterfaceClass zope.interface.interfaces.IMethod>,
-  <InterfaceClass zope.schema._bootstrapinterfaces.IFromUnicode>,
? ^

+ [<InterfaceClass zope.schema._bootstrapinterfaces.IFromUnicode>,
? ^

   <InterfaceClass zope.schema.interfaces.IText>,
   <InterfaceClass zope.schema.interfaces.IField>,
-  <InterfaceClass zope.interface.interfaces.IAttribute>]
?                                                       ^

+  <InterfaceClass zope.interface.interfaces.IAttribute>,
?                                                       ^

+  <InterfaceClass zope.interface.interfaces.IElement>]

Ran 410 tests in 0.170s

FAILED (failures=1)

I don't know exactly what this tests, so I ahve no idea why it fails.

This report is automated and not very verbose, but we'll try to get back here with details.

For the build logs, see:

For all our attempts to build python-zope-schema with Python 3.10, see:

Testing and mass rebuild of packages is happening in copr. You can follow these instructions to test locally in mock if your package builds with Python 3.10:

Let us know here if you have any questions.

Python 3.10 will be included in Fedora 35. To make that update smoother, we're building Fedora packages with early pre-releases of Python 3.10.
A build failure prevents us from testing all dependent packages (transitive [Build]Requires), so if this package is required a lot, it's important for us to get it fixed soon.
We'd appreciate help from the people who know this package best, but if you don't want to work on this now, let us know so we can try to work around it on our side.

Comment 1 Miro Hrončok 2021-06-04 20:14:36 UTC
This is a mass-posted update. Sorry if it is not 100% accurate to this bugzilla.

The Python 3.10 rebuild is in progress in a Koji side tag. If you manage to fix the problem, please commit the fix in the rawhide branch, but don't build the package in regular rawhide.

You can either build the package in the side tag, with:

    $ fedpkg build --target=f35-python

Or you can the build and we will eventually build it for you.

Note that the rebuild is still in progress, so not all (build) dependencies of this package might be available right away.


See also

If you have general questions about the rebuild, please use this mailing list thread:

Comment 2 Miro Hrončok 2021-06-07 22:59:12 UTC
The f35-python side tag has been merged to Rawhide. From now on, build as you would normally build.

Note You need to log in before you can comment on or make changes to this bug.