Note: This is a public test instance of Red Hat Bugzilla. The data contained within is a snapshot of the live data so any changes you make will not be reflected in the production Bugzilla. Email is disabled so feel free to test any aspect of the site that you want. File any problems you find or give feedback at
Bug 1964867 - gdal fails to build with Python 3.10: java.lang.RuntimeException: Failed to load XMvn configuration
Summary: gdal fails to build with Python 3.10: java.lang.RuntimeException: Failed to l...
Alias: None
Product: Fedora
Classification: Fedora
Component: gdal
Version: rawhide
Hardware: Unspecified
OS: Unspecified
Target Milestone: ---
Assignee: Sandro Mani
QA Contact: Fedora Extras Quality Assurance
Depends On:
Blocks: PYTHON3.10
TreeView+ depends on / blocked
Reported: 2021-05-26 08:43 UTC by Tomáš Hrnčiar
Modified: 2021-06-07 15:35 UTC (History)
12 users (show)

Fixed In Version:
Doc Type: If docs needed, set a value
Doc Text:
Clone Of:
Last Closed: 2021-06-07 15:35:07 UTC
Type: Bug

Attachments (Terms of Use)

Description Tomáš Hrnčiar 2021-05-26 08:43:17 UTC
gdal fails to build with Python 3.10.0b1.

+ xmvn-install -R .xmvn-reactor -n gdal -d /builddir/build/BUILDROOT/gdal-3.3.0-6.fc35.x86_64
Unhandled exception
java.lang.RuntimeException: Failed to load XMvn configuration
	at org.fedoraproject.xmvn.config.impl.DefaultConfigurator.loadConfiguration(
	at org.fedoraproject.xmvn.config.impl.DefaultConfigurator.getConfiguration(
Caused by: Failed to parse configuration
	at org.fedoraproject.xmvn.config.impl.DefaultConfigurator.loadConfigurationFromStream(
	at org.fedoraproject.xmvn.config.impl.DefaultConfigurator.loadConfiguration(
	at org.fedoraproject.xmvn.config.impl.DefaultConfigurator.loadConfiguration(
	... 4 more
Caused by: ParseError at [row,col]:[4,21]
Message: Unrecognised tag: 'skippedPlugins'
	at org.fedoraproject.xmvn.config.impl.DefaultConfigurator.loadConfigurationFromStream(
	... 6 more

For the build logs, see:

For all our attempts to build gdal with Python 3.10, see:

Testing and mass rebuild of packages is happening in copr. You can follow these instructions to test locally in mock if your package builds with Python 3.10:

Let us know here if you have any questions.

Python 3.10 will be included in Fedora 35. To make that update smoother, we're building Fedora packages with early pre-releases of Python 3.10.
A build failure prevents us from testing all dependent packages (transitive [Build]Requires), so if this package is required a lot, it's important for us to get it fixed soon.
We'd appreciate help from the people who know this package best, but if you don't want to work on this now, let us know so we can try to work around it on our side.

Comment 1 Sandro Mani 2021-05-26 21:32:37 UTC
So this is definitely not something related to Python, but rather to Java, otoh it builds fine in current rawhide [1]. Not sure where this comes from?


Comment 2 Miro Hrončok 2021-06-04 20:15:29 UTC
This is a mass-posted update. Sorry if it is not 100% accurate to this bugzilla.

The Python 3.10 rebuild is in progress in a Koji side tag. If you manage to fix the problem, please commit the fix in the rawhide branch, but don't build the package in regular rawhide.

You can either build the package in the side tag, with:

    $ fedpkg build --target=f35-python

Or you can the build and we will eventually build it for you.

Note that the rebuild is still in progress, so not all (build) dependencies of this package might be available right away.


See also

If you have general questions about the rebuild, please use this mailing list thread:

Comment 3 Sandro Mani 2021-06-07 15:35:07 UTC
Looks like the latest build is successfull [1].


Note You need to log in before you can comment on or make changes to this bug.